BDBM535171 WO2022021841, 1
SMILES COC(=O)C[C@H](NC(=O)[C@@H]1CCCN1C(=O)c1cc2ccccc2[nH]1)C(=O)CF
InChI Key
Data  1 KI
  Tab Delimited (TSV)   2D SDfile   Computed 3D by Vconf -m prep SDfile
Find this compound or compounds like it in BindingDB:
Activity Spreadsheet -- Enzyme Inhibition Constant Data from BindingDB
Found 1 hit for monomerid = 535171
TargetReplicase polyprotein 1ab(2019-nCoV)
Sichuan University
WIPO
LigandPNGBDBM535171(WO2022021841, 1)
Affinity DataKi:  1.10E+3nM. Assay description: SARS-CoV-2 Mpro (final concentration 750 nM) plus every compound in 25 uL of buffer (20 mM Tris-HCl, pH 7.5, 150mM NaCl,1mM EDTA,2mM DT...
Ligand InfoPC cidPC sid
In DepthDetails PubMed