BDBM535807 WO2022021841, 46
SMILES O=C[C@H](C[C@@H]1CCNC1=O)NC(=O)C1[C@@H]2CCC[C@H]2CN1C(=O)COc1cccc(c1)-c1ccccc1
InChI Key InChIKey=PPZVRSWNJWWSMI-MDHWJKIFSA-N
Data  1 KI
  Tab Delimited (TSV)   2D SDfile   Computed 3D by Vconf -m prep SDfile
Find this compound or compounds like it in BindingDB:
Activity Spreadsheet -- Enzyme Inhibition Constant Data from BindingDB
Found 1 hit for monomerid = 535807
TargetReplicase polyprotein 1ab(2019-nCoV)
Sichuan University
WIPO
LigandPNGBDBM535807(WO2022021841, 46)
Affinity DataKi:  10nM. Assay description: SARS-CoV-2 Mpro (final concentration 750 nM) plus every compound in 25 uL of buffer (20 mM Tris-HCl, pH 7.5, 150mM NaCl,1mM EDTA,2mM DT...
Ligand InfoPC cidPC sid
In DepthDetails PubMed