BDBM535839 WO2022021841, 73
SMILES Oc1cccc(CCC(=O)N2C[C@@H]3CCC[C@H]3C2C(=O)N[C@@H](C[C@@H]2CCNC2=O)C=O)c1
InChI Key InChIKey=VINDACCOLFBNRO-MVKLKDNSSA-N
Data  1 KI
  Tab Delimited (TSV)   2D SDfile   Computed 3D by Vconf -m prep SDfile
Find this compound or compounds like it in BindingDB:
Activity Spreadsheet -- Enzyme Inhibition Constant Data from BindingDB
Found 1 hit for monomerid = 535839
TargetReplicase polyprotein 1ab(2019-nCoV)
Sichuan University
WIPO
LigandPNGBDBM535839(WO2022021841, 73)
Affinity DataKi:  31nM. Assay description: SARS-CoV-2 Mpro (final concentration 750 nM) plus every compound in 25 uL of buffer (20 mM Tris-HCl, pH 7.5, 150mM NaCl,1mM EDTA,2mM DT...
Ligand InfoPC cidPC sid
In DepthDetails PubMed