BDBM54118 2-(5-pyrrolidin-1-ylsulfonylthiophen-2-yl)-N-[2-(4-sulfamoylphenyl)ethyl]acetamide::2-(5-pyrrolidin-1-ylsulfonylthiophen-2-yl)-N-[2-(4-sulfamoylphenyl)ethyl]ethanamide::2-(5-pyrrolidinosulfonyl-2-thienyl)-N-[2-(4-sulfamoylphenyl)ethyl]acetamide::2-[5-(1-pyrrolidinylsulfonyl)-2-thiophenyl]-N-[2-(4-sulfamoylphenyl)ethyl]acetamide::MLS001002287::SMR000368819::cid_2409301
SMILES NS(=O)(=O)c1ccc(CCNC(=O)Cc2ccc(s2)S(=O)(=O)N2CCCC2)cc1
InChI Key InChIKey=YJJPYTKHCZZEEE-UHFFFAOYSA-N
Data  1 IC50
  Tab Delimited (TSV)   2D SDfile   Computed 3D by Vconf -m prep SDfile
Find this compound or compounds like it in BindingDB:
Activity Spreadsheet -- Enzyme Inhibition Constant Data from BindingDB
Found 1 hit for monomerid = 54118
TargetM1 family aminopeptidase(Plasmodium falciparum (isolate FcB1 / Columbia))
Srmlsc
Curated by PubChem BioAssay
LigandPNGBDBM54118(2-(5-pyrrolidin-1-ylsulfonylthiophen-2-yl)-N-[2-(4...)
Affinity DataIC50:  8.91E+3nM. Assay description: Southern Research Molecular Libraries Screening Center (SRMLSC) Southern Research Institute (Birmingham, Alabama) NIH Molecular Libraries Screening...
In DepthDetails PCBioAssay