BDBM544905 US11286268, Compound 391
SMILES CCCCc1nc2c(cc1C(F)(F)F)nc(C)n(CCOc1ccc(Cl)cc1-c1cc(C)nc3c(csc13)C(O)=O)c2=O
InChI Key InChIKey=CSNHBUJEVMHVNO-UHFFFAOYSA-N
Data  1 IC50
  Tab Delimited (TSV)   2D SDfile   Computed 3D by Vconf -m prep SDfile
Find this compound or compounds like it in BindingDB:
Activity Spreadsheet -- Enzyme Inhibition Constant Data from BindingDB
Found 1 hit for monomerid = 544905
TargetEukaryotic translation initiation factor 4E-binding protein 1(Homo sapiens (Human))
Effector Therapeutics
US Patent
LigandPNGBDBM544905(US11286268, Compound 391)
Affinity DataIC50:  3.52nM. Assay description: eIF4E protein was pre-incubated with EDA-m7GDP-ATTO-550 in FPB at 2xconcentrations for 5 minutes prior to the addition of compounds. Compounds (100x)...
Ligand InfoPC cidPC sid
In DepthDetails US Patent