BDBM544953 US11286268, Compound 439a
SMILES CN(C)c1c(cc2nc(C)n(CCOc3ccc(Cl)cc3-c3cc(C)nc4c(csc34)C(O)=O)c(=O)c2c1C#N)C(F)F
InChI Key InChIKey=WPLXPHBEDGHMFG-UHFFFAOYSA-N
Data  1 IC50
  Tab Delimited (TSV)   2D SDfile   Computed 3D by Vconf -m prep SDfile
Find this compound or compounds like it in BindingDB:
Activity Spreadsheet -- Enzyme Inhibition Constant Data from BindingDB
Found 1 hit for monomerid = 544953
TargetEukaryotic translation initiation factor 4E-binding protein 1(Homo sapiens (Human))
Effector Therapeutics
US Patent
LigandPNGBDBM544953(US11286268, Compound 439a)
Affinity DataIC50:  2.87nM. Assay description: eIF4E protein was pre-incubated with EDA-m7GDP-ATTO-550 in FPB at 2xconcentrations for 5 minutes prior to the addition of compounds. Compounds (100x)...
Ligand InfoPC cidPC sid
In DepthDetails US Patent