BDBM54630 4-[3-(4-methoxyphenyl)-5-phenyl-3,4-dihydropyrazol-2-yl]benzamide::4-[5-(4-methoxyphenyl)-3-phenyl-2-pyrazolin-1-yl]benzamide::UNM-0000305870::cid_2952426
SMILES COc1ccc(cc1)C1CC(=NN1c1ccc(cc1)C(N)=O)c1ccccc1
InChI Key InChIKey=YZYIYCQWTJRWLV-UHFFFAOYSA-N
Data  8 EC50
  Tab Delimited (TSV)   2D SDfile   Computed 3D by Vconf -m prep SDfile
Find this compound or compounds like it in BindingDB:
Activity Spreadsheet -- Enzyme Inhibition Constant Data from BindingDB
Found 8 hits for monomerid = 54630
TargetRas-related protein Rab-2A(Canis lupus familiaris)
Nmmlsc
Curated by PubChem BioAssay
LigandPNGBDBM54630(4-[3-(4-methoxyphenyl)-5-phenyl-3,4-dihydropyrazol...)
Affinity DataEC50:  3.00E+4nM. Assay description: University of New Mexico Assay Overview: Assay Support: NIH I RO3 MH081231-01 HTS to identify specific small molecule inhibitors of Ras and Ras-rela...
In DepthDetails PCBioAssay
TargetGTPase KRas [1-37](Homo sapiens (Human))
Nmmlsc
Curated by PubChem BioAssay
LigandPNGBDBM54630(4-[3-(4-methoxyphenyl)-5-phenyl-3,4-dihydropyrazol...)
Affinity DataEC50:  3.00E+4nM. Assay description: University of New Mexico Assay Overview: Assay Support: NIH I RO3 MH081231-01 HTS to identify specific small molecule inhibitors of Ras and Ras-rela...
In DepthDetails PCBioAssay
LigandPNGBDBM54630(4-[3-(4-methoxyphenyl)-5-phenyl-3,4-dihydropyrazol...)
Affinity DataEC50:  3.00E+4nM. Assay description: University of New Mexico Assay Overview: Assay Support: NIH I RO3 MH081231-01 HTS to identify specific small molecule inhibitors of Ras and Ras-rela...
In DepthDetails PCBioAssay
TargetRas-related protein Rab-7a(Canis lupus familiaris)
Nmmlsc
Curated by PubChem BioAssay
LigandPNGBDBM54630(4-[3-(4-methoxyphenyl)-5-phenyl-3,4-dihydropyrazol...)
Affinity DataEC50:  3.00E+4nM. Assay description: University of New Mexico Assay Overview: Assay Support: NIH I RO3 MH081231-01 HTS to identify specific small molecule inhibitors of Ras and Ras-rela...
In DepthDetails PCBioAssay
LigandPNGBDBM54630(4-[3-(4-methoxyphenyl)-5-phenyl-3,4-dihydropyrazol...)
Affinity DataEC50:  3.00E+4nM. Assay description: University of New Mexico Assay Overview: Assay Support: NIH I RO3 MH081231-01 HTS to identify specific small molecule inhibitors of Ras and Ras-rela...
In DepthDetails PCBioAssay
TargetCell division control protein 42 homolog(Homo sapiens (Human))
Nmmlsc
Curated by PubChem BioAssay
LigandPNGBDBM54630(4-[3-(4-methoxyphenyl)-5-phenyl-3,4-dihydropyrazol...)
Affinity DataEC50:  3.00E+4nM. Assay description: University of New Mexico Assay Overview: Assay Support: NIH I RO3 MH081231-01 HTS to identify specific small molecule inhibitors of Ras and Ras-rela...
In DepthDetails PCBioAssay
TargetCell division control protein 42 homolog(Homo sapiens (Human))
Nmmlsc
Curated by PubChem BioAssay
LigandPNGBDBM54630(4-[3-(4-methoxyphenyl)-5-phenyl-3,4-dihydropyrazol...)
Affinity DataEC50:  3.00E+4nM. Assay description: University of New Mexico Assay Overview: Assay Support: NIH I RO3 MH081231-01 HTS to identify specific small molecule inhibitors of Ras and Ras-rela...
In DepthDetails PCBioAssay
TargetGTPase KRas [1-37](Homo sapiens (Human))
Nmmlsc
Curated by PubChem BioAssay
LigandPNGBDBM54630(4-[3-(4-methoxyphenyl)-5-phenyl-3,4-dihydropyrazol...)
Affinity DataEC50:  3.00E+4nM. Assay description: University of New Mexico Assay Overview: Assay Support: NIH I RO3 MH081231-01 HTS to identify specific small molecule inhibitors of Ras and Ras-rela...
In DepthDetails PCBioAssay