BDBM54675 (5Z)-5-(2-ketoindolin-3-ylidene)hydantoin::(5Z)-5-(2-oxidanylidene-1H-indol-3-ylidene)imidazolidine-2,4-dione::(5Z)-5-(2-oxo-1H-indol-3-ylidene)imidazolidine-2,4-dione::UNM-0000305761::cid_15716919
SMILES O=C1NC(=O)\C(N1)=C1\C(=O)Nc2ccccc12
InChI Key InChIKey=XIEFGKUPNUMDCI-FPLPWBNLSA-N
Data  3 KI  8 EC50
  Tab Delimited (TSV)   2D SDfile   Computed 3D by Vconf -m prep SDfile
Find this compound or compounds like it in BindingDB:
Activity Spreadsheet -- Enzyme Inhibition Constant Data from BindingDB
Found 11 hits for monomerid = 54675
LigandPNGBDBM54675((5Z)-5-(2-ketoindolin-3-ylidene)hydantoin | (5Z)-5...)
Affinity DataKi:  250nM. Assay description: University of New Mexico Assay Overview: Assay Support: NIH I RO3 MH081231-01 HTS to identify specific small molecule inhibitors of Ras and Ras-rela...
In DepthDetails PCBioAssay
TargetCell division control protein 42 homolog(Homo sapiens (Human))
Nmmlsc
Curated by PubChem BioAssay
LigandPNGBDBM54675((5Z)-5-(2-ketoindolin-3-ylidene)hydantoin | (5Z)-5...)
Affinity DataKi:  810nM. Assay description: University of New Mexico Assay Overview: Assay Support: NIH I RO3 MH081231-01 HTS to identify specific small molecule inhibitors of Ras and Ras-rela...
In DepthDetails PCBioAssay
LigandPNGBDBM54675((5Z)-5-(2-ketoindolin-3-ylidene)hydantoin | (5Z)-5...)
Affinity DataKi:  1.06E+3nM. Assay description: University of New Mexico Assay Overview: Assay Support: NIH I RO3 MH081231-01 HTS to identify specific small molecule inhibitors of Ras and Ras-rela...
In DepthDetails PCBioAssay
TargetRas-related protein Rab-7a(Canis lupus familiaris)
Nmmlsc
Curated by PubChem BioAssay
LigandPNGBDBM54675((5Z)-5-(2-ketoindolin-3-ylidene)hydantoin | (5Z)-5...)
Affinity DataEC50:  3.00E+4nM. Assay description: University of New Mexico Assay Overview: Assay Support: NIH I RO3 MH081231-01 HTS to identify specific small molecule inhibitors of Ras and Ras-rela...
In DepthDetails PCBioAssay
TargetGTPase KRas [1-37](Homo sapiens (Human))
Nmmlsc
Curated by PubChem BioAssay
LigandPNGBDBM54675((5Z)-5-(2-ketoindolin-3-ylidene)hydantoin | (5Z)-5...)
Affinity DataEC50:  3.00E+4nM. Assay description: University of New Mexico Assay Overview: Assay Support: NIH I RO3 MH081231-01 HTS to identify specific small molecule inhibitors of Ras and Ras-rela...
In DepthDetails PCBioAssay
LigandPNGBDBM54675((5Z)-5-(2-ketoindolin-3-ylidene)hydantoin | (5Z)-5...)
Affinity DataEC50:  1.16E+4nM. Assay description: University of New Mexico Assay Overview: Assay Support: NIH I RO3 MH081231-01 HTS to identify specific small molecule inhibitors of Ras and Ras-rela...
In DepthDetails PCBioAssay
LigandPNGBDBM54675((5Z)-5-(2-ketoindolin-3-ylidene)hydantoin | (5Z)-5...)
Affinity DataEC50:  2.64E+3nM. Assay description: University of New Mexico Assay Overview: Assay Support: NIH I RO3 MH081231-01 HTS to identify specific small molecule inhibitors of Ras and Ras-rela...
In DepthDetails PCBioAssay
TargetCell division control protein 42 homolog(Homo sapiens (Human))
Nmmlsc
Curated by PubChem BioAssay
LigandPNGBDBM54675((5Z)-5-(2-ketoindolin-3-ylidene)hydantoin | (5Z)-5...)
Affinity DataEC50:  3.00E+4nM. Assay description: University of New Mexico Assay Overview: Assay Support: NIH I RO3 MH081231-01 HTS to identify specific small molecule inhibitors of Ras and Ras-rela...
In DepthDetails PCBioAssay
TargetCell division control protein 42 homolog(Homo sapiens (Human))
Nmmlsc
Curated by PubChem BioAssay
LigandPNGBDBM54675((5Z)-5-(2-ketoindolin-3-ylidene)hydantoin | (5Z)-5...)
Affinity DataEC50:  5.26E+3nM. Assay description: University of New Mexico Assay Overview: Assay Support: NIH I RO3 MH081231-01 HTS to identify specific small molecule inhibitors of Ras and Ras-rela...
In DepthDetails PCBioAssay
TargetRas-related protein Rab-2A(Canis lupus familiaris)
Nmmlsc
Curated by PubChem BioAssay
LigandPNGBDBM54675((5Z)-5-(2-ketoindolin-3-ylidene)hydantoin | (5Z)-5...)
Affinity DataEC50:  3.00E+4nM. Assay description: University of New Mexico Assay Overview: Assay Support: NIH I RO3 MH081231-01 HTS to identify specific small molecule inhibitors of Ras and Ras-rela...
In DepthDetails PCBioAssay
TargetGTPase KRas [1-37](Homo sapiens (Human))
Nmmlsc
Curated by PubChem BioAssay
LigandPNGBDBM54675((5Z)-5-(2-ketoindolin-3-ylidene)hydantoin | (5Z)-5...)
Affinity DataEC50:  3.00E+4nM. Assay description: University of New Mexico Assay Overview: Assay Support: NIH I RO3 MH081231-01 HTS to identify specific small molecule inhibitors of Ras and Ras-rela...
In DepthDetails PCBioAssay