BDBM54698 3-phenyl-1-(3-pyridinyl)-2-propyn-1-one::3-phenyl-1-(3-pyridyl)prop-2-yn-1-one::3-phenyl-1-pyridin-3-yl-prop-2-yn-1-one::3-phenyl-1-pyridin-3-ylprop-2-yn-1-one::UNM-0000306056::cid_326117
SMILES O=C(C#Cc1ccccc1)c1cccnc1
InChI Key InChIKey=RWSCAPDAIPEMLF-UHFFFAOYSA-N
Data  7 EC50
  Tab Delimited (TSV)   2D SDfile   Computed 3D by Vconf -m prep SDfile
Find this compound or compounds like it in BindingDB:
Activity Spreadsheet -- Enzyme Inhibition Constant Data from BindingDB
Found 7 hits for monomerid = 54698
TargetGTPase KRas [1-37](Homo sapiens (Human))
Nmmlsc
Curated by PubChem BioAssay
LigandPNGBDBM54698(3-phenyl-1-(3-pyridinyl)-2-propyn-1-one | 3-phenyl...)
Affinity DataEC50:  3.00E+4nM. Assay description: University of New Mexico Assay Overview: Assay Support: NIH I RO3 MH081231-01 HTS to identify specific small molecule inhibitors of Ras and Ras-rela...
In DepthDetails PCBioAssay
TargetRas-related protein Rab-2A(Canis lupus familiaris)
Nmmlsc
Curated by PubChem BioAssay
LigandPNGBDBM54698(3-phenyl-1-(3-pyridinyl)-2-propyn-1-one | 3-phenyl...)
Affinity DataEC50:  3.00E+4nM. Assay description: University of New Mexico Assay Overview: Assay Support: NIH I RO3 MH081231-01 HTS to identify specific small molecule inhibitors of Ras and Ras-rela...
In DepthDetails PCBioAssay
TargetCell division control protein 42 homolog(Homo sapiens (Human))
Nmmlsc
Curated by PubChem BioAssay
LigandPNGBDBM54698(3-phenyl-1-(3-pyridinyl)-2-propyn-1-one | 3-phenyl...)
Affinity DataEC50:  3.00E+4nM. Assay description: University of New Mexico Assay Overview: Assay Support: NIH I RO3 MH081231-01 HTS to identify specific small molecule inhibitors of Ras and Ras-rela...
In DepthDetails PCBioAssay
LigandPNGBDBM54698(3-phenyl-1-(3-pyridinyl)-2-propyn-1-one | 3-phenyl...)
Affinity DataEC50:  3.00E+4nM. Assay description: University of New Mexico Assay Overview: Assay Support: NIH I RO3 MH081231-01 HTS to identify specific small molecule inhibitors of Ras and Ras-rela...
In DepthDetails PCBioAssay
TargetRas-related protein Rab-7a(Canis lupus familiaris)
Nmmlsc
Curated by PubChem BioAssay
LigandPNGBDBM54698(3-phenyl-1-(3-pyridinyl)-2-propyn-1-one | 3-phenyl...)
Affinity DataEC50:  3.00E+4nM. Assay description: University of New Mexico Assay Overview: Assay Support: NIH I RO3 MH081231-01 HTS to identify specific small molecule inhibitors of Ras and Ras-rela...
In DepthDetails PCBioAssay
TargetGTPase KRas [1-37](Homo sapiens (Human))
Nmmlsc
Curated by PubChem BioAssay
LigandPNGBDBM54698(3-phenyl-1-(3-pyridinyl)-2-propyn-1-one | 3-phenyl...)
Affinity DataEC50:  3.00E+4nM. Assay description: University of New Mexico Assay Overview: Assay Support: NIH I RO3 MH081231-01 HTS to identify specific small molecule inhibitors of Ras and Ras-rela...
In DepthDetails PCBioAssay
TargetCell division control protein 42 homolog(Homo sapiens (Human))
Nmmlsc
Curated by PubChem BioAssay
LigandPNGBDBM54698(3-phenyl-1-(3-pyridinyl)-2-propyn-1-one | 3-phenyl...)
Affinity DataEC50:  3.00E+4nM. Assay description: University of New Mexico Assay Overview: Assay Support: NIH I RO3 MH081231-01 HTS to identify specific small molecule inhibitors of Ras and Ras-rela...
In DepthDetails PCBioAssay