BDBM547816 WO2022090481, Example I-031
SMILES COc1ccncc1-c1cc2n(ncc2c(C)n1)-c1cc2n(C)c(C)nc2c(n1)N1CCOC[C@@H]1C
InChI Key InChIKey=HVRBGAMDLCCQFW-HNNXBMFYSA-N
Data  1 IC50
  Tab Delimited (TSV)   2D SDfile   Computed 3D by Vconf -m prep SDfile
Find this compound or compounds like it in BindingDB:
Activity Spreadsheet -- Enzyme Inhibition Constant Data from BindingDB
Found 1 hit for monomerid = 547816
TargetEpidermal growth factor receptor [1-18,20-1210,T790M,C797S](Homo sapiens (Human))
Boehringer Ingelheim International
WIPO
LigandPNGBDBM547816(WO2022090481, Example I-031)
Affinity DataIC50:  1.20nM. Assay description:  Ba/F3 cells were ordered from DSMZ (ACC300, Lot17) and grown in RPMI-1640 (ATCC 30-2001) + 10 % FCS + 10 ng/ml IL-3 at 37 °C in 5 % CO2 atmosphere. ...
Ligand InfoPC cidPC sid
In DepthDetails PubMed