BDBM547838 WO2022090481, Example I-053
SMILES COc1ccncc1-c1cc2n(ncc2c(C)n1)-c1cc2n(C)cnc2c(n1)C(C)C
InChI Key InChIKey=MZYBIKFADYGWHF-UHFFFAOYSA-N
Data  1 IC50
  Tab Delimited (TSV)   2D SDfile   Computed 3D by Vconf -m prep SDfile
Find this compound or compounds like it in BindingDB:
Activity Spreadsheet -- Enzyme Inhibition Constant Data from BindingDB
Found 1 hit for monomerid = 547838
TargetEpidermal growth factor receptor [1-18,20-1210,T790M,C797S](Homo sapiens (Human))
Boehringer Ingelheim International
WIPO
LigandPNGBDBM547838(WO2022090481, Example I-053)
Affinity DataIC50:  1.10nM. Assay description:  Ba/F3 cells were ordered from DSMZ (ACC300, Lot17) and grown in RPMI-1640 (ATCC 30-2001) + 10 % FCS + 10 ng/ml IL-3 at 37 °C in 5 % CO2 atmosphere. ...
Ligand InfoPC cidPC sid
In DepthDetails PubMed