BDBM548011 WO2022091056, Example 5
SMILES CCc1nocc1C(=O)N[C@@H](C1CCCC1)C(=O)Nc1ccc(cc1)-c1c(C)[n+]([O-])ccc1C(F)(F)F
InChI Key InChIKey=FUFCNAAOWQFDJY-QHCPKHFHSA-N
Data  1 IC50
  Tab Delimited (TSV)   2D SDfile   Computed 3D by Vconf -m prep SDfile
Find this compound or compounds like it in BindingDB:
Activity Spreadsheet -- Enzyme Inhibition Constant Data from BindingDB
Found 1 hit for monomerid = 548011
TargetInterleukin-17 receptor A/(Homo sapiens (Human))
Novartis
WIPO
LigandPNGBDBM548011(WO2022091056, Example 5)
Affinity DataIC50:  28nM. Assay description:  Dilutions of test compounds in DMSO are plated onto white low-volume 384-well plates (Greiner, #784075). Specifically, solutions of graded concentra...
Ligand InfoPC cidPC sid
In DepthDetails PubMed