BDBM548014 3-(4-((S)-2-(3-ethylisoxazole-4-carboxamido)-2-((1r,4S)-4- (trifluoromethyl)cyclohexyl)acetamido)phenyl)-2,4-dimethylpyridine 1-oxide::WO2022091056, Example 8
SMILES CCc1nocc1C(=O)N[C@@H]([C@H]1CC[C@H](CC1)C(F)(F)F)C(=O)Nc1ccc(cc1)-c1c(C)cc[n+]([O-])c1C
InChI Key InChIKey=RMGKRDBEMKRZFJ-DFIYOIEZSA-N
Data  1 IC50
  Tab Delimited (TSV)   2D SDfile   Computed 3D by Vconf -m prep SDfile
Find this compound or compounds like it in BindingDB:
Activity Spreadsheet -- Enzyme Inhibition Constant Data from BindingDB
Found 1 hit for monomerid = 548014
TargetInterleukin-17 receptor A/(Homo sapiens (Human))
Novartis
WIPO
LigandPNGBDBM548014(3-(4-((S)-2-(3-ethylisoxazole-4-carboxamido)-2-((1...)
Affinity DataIC50:  41nM. Assay description:  Dilutions of test compounds in DMSO are plated onto white low-volume 384-well plates (Greiner, #784075). Specifically, solutions of graded concentra...
Ligand InfoPC cidPC sid
In DepthDetails PubMed