BDBM548023 WO2022091056, Example 15
SMILES COCCn1nccc1C(=O)N[C@@H](C1CCCCC1)C(=O)Nc1ccc(c(F)c1)-c1c(Cl)cc[n+]([O-])c1C
InChI Key InChIKey=HRBHCPXGUIFPPY-VWLOTQADSA-N
Data  1 IC50
  Tab Delimited (TSV)   2D SDfile   Computed 3D by Vconf -m prep SDfile
Find this compound or compounds like it in BindingDB:
Activity Spreadsheet -- Enzyme Inhibition Constant Data from BindingDB
Found 1 hit for monomerid = 548023
TargetInterleukin-17 receptor A/(Homo sapiens (Human))
Novartis
WIPO
LigandPNGBDBM548023(WO2022091056, Example 15)
Affinity DataIC50:  52nM. Assay description:  Dilutions of test compounds in DMSO are plated onto white low-volume 384-well plates (Greiner, #784075). Specifically, solutions of graded concentra...
Ligand InfoPC cidPC sid
In DepthDetails PubMed