BDBM548036 WO2022091056, Example 28
SMILES CCc1nocc1C(=O)N[C@@H]([C@H]1CCC(F)=CC1)C(=O)Nc1ccc(cc1)-c1c(C)cc[n+]([O-])c1C
InChI Key InChIKey=MOOZRWAAAYNKHZ-CLOONOSVSA-N
Data  1 IC50
  Tab Delimited (TSV)   2D SDfile   Computed 3D by Vconf -m prep SDfile
Find this compound or compounds like it in BindingDB:
Activity Spreadsheet -- Enzyme Inhibition Constant Data from BindingDB
Found 1 hit for monomerid = 548036
TargetInterleukin-17 receptor A/(Homo sapiens (Human))
Novartis
WIPO
LigandPNGBDBM548036(WO2022091056, Example 28)
Affinity DataIC50:  20nM. Assay description:  Dilutions of test compounds in DMSO are plated onto white low-volume 384-well plates (Greiner, #784075). Specifically, solutions of graded concentra...
Ligand InfoPC cidPC sid
In DepthDetails PubMed