BDBM548050 WO2022091056, Example 42
SMILES Cc1cc[n+]([O-])c(C)c1-c1ccc(NC(=O)[C@@H](NC(=O)c2ccnn2C2CC2)C2CCCCCC2)cc1
InChI Key InChIKey=IKGLUJWLQBJLFW-MHZLTWQESA-N
Data  1 IC50
  Tab Delimited (TSV)   2D SDfile   Computed 3D by Vconf -m prep SDfile
Find this compound or compounds like it in BindingDB:
Activity Spreadsheet -- Enzyme Inhibition Constant Data from BindingDB
Found 1 hit for monomerid = 548050
TargetInterleukin-17 receptor A/(Homo sapiens (Human))
Novartis
WIPO
LigandPNGBDBM548050(WO2022091056, Example 42)
Affinity DataIC50:  26nM. Assay description:  Dilutions of test compounds in DMSO are plated onto white low-volume 384-well plates (Greiner, #784075). Specifically, solutions of graded concentra...
Ligand InfoPC cidPC sid
In DepthDetails PubMed