BDBM548332 WO2022093856, Example 1-27
SMILES CNC(=O)C[C@H](CC(C)C)Nc1nc(nc2ccccc12)N1CC(F)C2(CN(C2)C(=O)C=C)C1
InChI Key InChIKey=SYLKDPPWMQIZDU-DIMJTDRSSA-N
Data  1 IC50
  Tab Delimited (TSV)   2D SDfile   Computed 3D by Vconf -m prep SDfile
Find this compound or compounds like it in BindingDB:
Activity Spreadsheet -- Enzyme Inhibition Constant Data from BindingDB
Found 1 hit for monomerid = 548332
TargetGTPase KRas [1-169,G12C,C118A](Homo sapiens (Human))
Amgen
WIPO
LigandPNGBDBM548332(WO2022093856, Example 1-27)
Affinity DataIC50:  3.49E+3nM
Ligand InfoPC cidPC sid
In DepthDetails PubMed