BDBM548341 WO2022093856, Example 1-36
SMILES CNC(=O)C[C@H](CC(C)C)Nc1nc(nc2cc(cnc12)-c1nccs1)N1CCC2(CN(C2)C(=O)C=C)C1
InChI Key InChIKey=BAWUGNOZDABWHV-IBGZPJMESA-N
Data  1 IC50
  Tab Delimited (TSV)   2D SDfile   Computed 3D by Vconf -m prep SDfile
Find this compound or compounds like it in BindingDB:
Activity Spreadsheet -- Enzyme Inhibition Constant Data from BindingDB
Found 1 hit for monomerid = 548341
TargetGTPase KRas [1-169,G12C,C118A](Homo sapiens (Human))
Amgen
WIPO
LigandPNGBDBM548341(WO2022093856, Example 1-36)
Affinity DataIC50:  23nM
Ligand InfoPC cidPC sid
In DepthDetails PubMed