BDBM548342 WO2022093856, Example 1-37
SMILES CNC(=O)C[C@H](CC(C)C)Nc1nc(nc2cccnc12)N1CCC2(CN(C2)C(=O)C=C)C1
InChI Key InChIKey=DIYBXDCUIZSSQA-KRWDZBQOSA-N
Data  1 IC50
  Tab Delimited (TSV)   2D SDfile   Computed 3D by Vconf -m prep SDfile
Find this compound or compounds like it in BindingDB:
Activity Spreadsheet -- Enzyme Inhibition Constant Data from BindingDB
Found 1 hit for monomerid = 548342
TargetGTPase KRas [1-169,G12C,C118A](Homo sapiens (Human))
Amgen
WIPO
LigandPNGBDBM548342(WO2022093856, Example 1-37)
Affinity DataIC50:  743nM
Ligand InfoPC cidPC sid
In DepthDetails PubMed