BDBM548806 WO2022098806, Compound 2-67
SMILES Cc1c2NCCOc2ncc1-c1cc2nc(Nc3ccc(cc3)N3CCOC3=O)ncc2c(N)c1F
InChI Key InChIKey=HFIQRJRHVLXVTP-UHFFFAOYSA-N
Data  1 IC50
  Tab Delimited (TSV)   2D SDfile   Computed 3D by Vconf -m prep SDfile
Find this compound or compounds like it in BindingDB:
Activity Spreadsheet -- Enzyme Inhibition Constant Data from BindingDB
Found 1 hit for monomerid = 548806
TargetMitogen-activated protein kinase kinase kinase kinase 1(Homo sapiens (Human))
Merck Sharp &Amp
WIPO
LigandPNGBDBM548806(WO2022098806, Compound 2-67)
Affinity DataIC50:  0.0500nM. Assay description:  To each well of black Corning #3820384-well plate, an ECHO was used to dispense 7.5 nL of DMSO or Test compound in DMSO. A 1.5x kinase solution, 5 &...
Ligand InfoPC cidPC sid
In DepthDetails PubMed