BDBM548829 WO2022098806, Compound 2-179::WO2022098806, Compound 2-90::WO2022098806, Compound 2-93::WO2022098806, Compound 2-94
SMILES COc1cc2CCN(C)Cc2cc1Nc1ncc2c(N)c(F)c(c(Cl)c2n1)-c1cnc2OCCNc2c1C
InChI Key InChIKey=BAESBEAWDLAMPJ-UHFFFAOYSA-N
Data  4 IC50
  Tab Delimited (TSV)   2D SDfile   Computed 3D by Vconf -m prep SDfile
Find this compound or compounds like it in BindingDB:
Activity Spreadsheet -- Enzyme Inhibition Constant Data from BindingDB
Found 4 hits for monomerid = 548829
TargetMitogen-activated protein kinase kinase kinase kinase 1(Homo sapiens (Human))
Merck Sharp &Amp
WIPO
LigandPNGBDBM548829(WO2022098806, Compound 2-179 | WO2022098806, Compo...)
Affinity DataIC50:  0.0400nM. Assay description:  To each well of black Corning #3820384-well plate, an ECHO was used to dispense 7.5 nL of DMSO or Test compound in DMSO. A 1.5x kinase solution, 5 &...
Ligand InfoPC cidPC sid
In DepthDetails PubMed
TargetMitogen-activated protein kinase kinase kinase kinase 1(Homo sapiens (Human))
Merck Sharp &Amp
WIPO
LigandPNGBDBM548829(WO2022098806, Compound 2-179 | WO2022098806, Compo...)
Affinity DataIC50:  2.94nM. Assay description:  To each well of black Corning #3820384-well plate, an ECHO was used to dispense 7.5 nL of DMSO or Test compound in DMSO. A 1.5x kinase solution, 5 &...
Ligand InfoPC cidPC sid
In DepthDetails PubMed
TargetMitogen-activated protein kinase kinase kinase kinase 1(Homo sapiens (Human))
Merck Sharp &Amp
WIPO
LigandPNGBDBM548829(WO2022098806, Compound 2-179 | WO2022098806, Compo...)
Affinity DataIC50:  5.77nM. Assay description:  To each well of black Corning #3820384-well plate, an ECHO was used to dispense 7.5 nL of DMSO or Test compound in DMSO. A 1.5x kinase solution, 5 &...
Ligand InfoPC cidPC sid
In DepthDetails PubMed
TargetMitogen-activated protein kinase kinase kinase kinase 1(Homo sapiens (Human))
Merck Sharp &Amp
WIPO
LigandPNGBDBM548829(WO2022098806, Compound 2-179 | WO2022098806, Compo...)
Affinity DataIC50:  0.0200nM. Assay description:  To each well of black Corning #3820384-well plate, an ECHO was used to dispense 7.5 nL of DMSO or Test compound in DMSO. A 1.5x kinase solution, 5 &...
Ligand InfoPC cidPC sid
In DepthDetails PubMed