BDBM548848 WO2022098806, Compound 2-109
SMILES CN1Cc2cc(Nc3ncc4c(N)c(F)c(-c5cnc6OCCNc6c5C)c(C#N)c4n3)ccc2C2(CC2)C1
InChI Key InChIKey=LQIUMPORYPQLNU-UHFFFAOYSA-N
Data  1 IC50
  Tab Delimited (TSV)   2D SDfile   Computed 3D by Vconf -m prep SDfile
Find this compound or compounds like it in BindingDB:
Activity Spreadsheet -- Enzyme Inhibition Constant Data from BindingDB
Found 1 hit for monomerid = 548848
TargetMitogen-activated protein kinase kinase kinase kinase 1(Homo sapiens (Human))
Merck Sharp &Amp
WIPO
LigandPNGBDBM548848(WO2022098806, Compound 2-109)
Affinity DataIC50:  0.0500nM. Assay description:  To each well of black Corning #3820384-well plate, an ECHO was used to dispense 7.5 nL of DMSO or Test compound in DMSO. A 1.5x kinase solution, 5 &...
Ligand InfoPC cidPC sid
In DepthDetails PubMed