BDBM55016 (4E)-5-(3-chlorophenyl)-4-[2,3-dihydro-1,4-benzodioxin-6-yl(hydroxy)methylene]-1-(2-furfuryl)pyrrolidine-2,3-quinone::(4E)-5-(3-chlorophenyl)-4-[2,3-dihydro-1,4-benzodioxin-6-yl(hydroxy)methylidene]-1-(2-furanylmethyl)pyrrolidine-2,3-dione::(4E)-5-(3-chlorophenyl)-4-[2,3-dihydro-1,4-benzodioxin-6-yl(hydroxy)methylidene]-1-(furan-2-ylmethyl)pyrrolidine-2,3-dione::(4E)-5-(3-chlorophenyl)-4-[2,3-dihydro-1,4-benzodioxin-6-yl(oxidanyl)methylidene]-1-(furan-2-ylmethyl)pyrrolidine-2,3-dione::MLS000040316::SMR000058150::cid_5389627
SMILES Clc1cccc(c1)C1C(C(=O)c2ccc3OCCOc3c2)C(=O)C(=O)N1Cc1ccco1
InChI Key InChIKey=APXWBAKINIZCMY-UHFFFAOYSA-N
Data  1 IC50
  Tab Delimited (TSV)   2D SDfile   Computed 3D by Vconf -m prep SDfile
Find this compound or compounds like it in BindingDB:
Activity Spreadsheet -- Enzyme Inhibition Constant Data from BindingDB
Found 1 hit for monomerid = 55016
TargetGenome polyprotein(Hepatitis C virus)
The Scripps Research Institute Molecular Screening Center
Curated by PubChem BioAssay
LigandPNGBDBM55016((4E)-5-(3-chlorophenyl)-4-[2,3-dihydro-1,4-benzodi...)
Affinity DataIC50:  4.61E+3nM. Assay description: Source (MLPCN Center Name): The Scripps Research Institute Molecular Screening Center (SRIMSC) Center Affiliation: The Scripps Research Institute (TS...
In DepthDetails PCBioAssay