BDBM55036 (5E)-1-(3,4-dimethylphenyl)-5-[(E)-3-(2-furanyl)prop-2-enylidene]-1,3-diazinane-2,4,6-trione::(5E)-1-(3,4-dimethylphenyl)-5-[(E)-3-(2-furyl)prop-2-enylidene]barbituric acid::(5E)-1-(3,4-dimethylphenyl)-5-[(E)-3-(furan-2-yl)prop-2-enylidene]-1,3-diazinane-2,4,6-trione::1-(3,4-dimethylphenyl)-5-[3-(2-furyl)-2-propen-1-ylidene]-2,4,6(1H,3H,5H)-pyrimidinetrione::MLS000666508::SMR000268830::cid_2275810
SMILES Cc1ccc(cc1C)N1C(=O)NC(=O)C(=CC=Cc2ccco2)C1=O
InChI Key InChIKey=ZRUZNXPVKAJDBM-UHFFFAOYSA-N
Data  4 IC50  2 EC50
  Tab Delimited (TSV)   2D SDfile   Computed 3D by Vconf -m prep SDfile
Find this compound or compounds like it in BindingDB:
Activity Spreadsheet -- Enzyme Inhibition Constant Data from BindingDB
Found 6 hits for monomerid = 55036
TargetGenome polyprotein(Hepatitis C virus)
The Scripps Research Institute Molecular Screening Center
Curated by PubChem BioAssay
LigandPNGBDBM55036((5E)-1-(3,4-dimethylphenyl)-5-[(E)-3-(2-furanyl)pr...)
Affinity DataIC50:  1.44E+4nM. Assay description: Source (MLPCN Center Name): The Scripps Research Institute Molecular Screening Center (SRIMSC) Center Affiliation: The Scripps Research Institute (TS...
In DepthDetails PCBioAssay
TargetLarge T antigen(Simian virus 40)
Southern Research Specialized Biocontainment Screening Center
Curated by PubChem BioAssay
LigandPNGBDBM55036((5E)-1-(3,4-dimethylphenyl)-5-[(E)-3-(2-furanyl)pr...)
Affinity DataEC50: <100nM. Assay description: Southern Research's Specialized Biocontainment Screening Center (SRSBSC) Southern Research Institute (Birmingham, Alabama) NIH Molecular Librarie...
In DepthDetails PCBioAssay
TargetDNA damage-inducible transcript 3 protein(Mus musculus)
Emory University
Curated by PubChem BioAssay
LigandPNGBDBM55036((5E)-1-(3,4-dimethylphenyl)-5-[(E)-3-(2-furanyl)pr...)
Affinity DataIC50:  880nM. Assay description: NIH Molecular Libraries Screening Centers Network [MLSCN] Emory Chemical Biology Discovery Center in MLSCN Assay provider: Dr. Randal Kaufman, Univer...
In DepthDetails PCBioAssay
TargetHeat shock factor protein 1(Mus musculus)
Broad Institute
Curated by PubChem BioAssay
LigandPNGBDBM55036((5E)-1-(3,4-dimethylphenyl)-5-[(E)-3-(2-furanyl)pr...)
Affinity DataEC50:  4.85E+3nM. Assay description: Keywords: Heat Shock Factor-1 (HSF-1), Stress Response, MG132, NIH3T3, Luminescence Assay Overview: Confirmation testing of small molecules identifie...
In DepthDetails PCBioAssay
TargetX-box-binding protein 1(Homo sapiens (Human))
Emory University
Curated by PubChem BioAssay
LigandPNGBDBM55036((5E)-1-(3,4-dimethylphenyl)-5-[(E)-3-(2-furanyl)pr...)
Affinity DataIC50:  1.00E+4nM. Assay description: NIH Molecular Libraries Screening Centers Network [MLSCN] Emory Chemical Biology Discovery Center in MLSCN Assay provider: Dr. Randal Kaufman, Univer...
In DepthDetails PCBioAssay
TargetDNA damage-inducible transcript 3 protein(Mus musculus)
Emory University
Curated by PubChem BioAssay
LigandPNGBDBM55036((5E)-1-(3,4-dimethylphenyl)-5-[(E)-3-(2-furanyl)pr...)
Affinity DataIC50:  880nM. Assay description: NIH Molecular Libraries Screening Centers Network [MLSCN] Emory Chemical Biology Discovery Center in MLSCN Assay provider: Dr. Randal Kaufman, Univer...
In DepthDetails PCBioAssay