BDBM55063 2-(3-ethoxy-4-propoxy-phenyl)-1-(furan-2-ylmethyl)-3-(5-methylfuran-2-yl)carbonyl-4-oxidanyl-2H-pyrrol-5-one::2-(3-ethoxy-4-propoxyphenyl)-1-(2-furanylmethyl)-4-hydroxy-3-[(5-methyl-2-furanyl)-oxomethyl]-2H-pyrrol-5-one::2-(3-ethoxy-4-propoxyphenyl)-1-(furan-2-ylmethyl)-4-hydroxy-3-(5-methylfuran-2-carbonyl)-2H-pyrrol-5-one::5-(3-ethoxy-4-propoxy-phenyl)-1-(2-furfuryl)-3-hydroxy-4-(5-methyl-2-furoyl)-3-pyrrolin-2-one::MLS001125430::SMR000665963::cid_2944889
SMILES CCCOc1ccc(cc1OCC)C1C(C(=O)c2ccc(C)o2)C(=O)C(=O)N1Cc1ccco1
InChI Key InChIKey=CFXAXYQADOZYKH-UHFFFAOYSA-N
Data  1 IC50
  Tab Delimited (TSV)   2D SDfile   Computed 3D by Vconf -m prep SDfile
Find this compound or compounds like it in BindingDB:
Activity Spreadsheet -- Enzyme Inhibition Constant Data from BindingDB
Found 1 hit for monomerid = 55063
TargetGenome polyprotein(Hepatitis C virus)
The Scripps Research Institute Molecular Screening Center
Curated by PubChem BioAssay
LigandPNGBDBM55063(2-(3-ethoxy-4-propoxy-phenyl)-1-(furan-2-ylmethyl)...)
Affinity DataIC50:  5.19E+3nM. Assay description: Source (MLPCN Center Name): The Scripps Research Institute Molecular Screening Center (SRIMSC) Center Affiliation: The Scripps Research Institute (TS...
In DepthDetails PCBioAssay