BDBM55069 1-benzyl-2-(3-ethoxyphenyl)-4-hydroxy-3-(5-methylfuran-2-carbonyl)-2H-pyrrol-5-one::1-benzyl-3-hydroxy-4-(5-methyl-2-furoyl)-5-m-phenetyl-3-pyrrolin-2-one::1-benzyl-5-(3-ethoxyphenyl)-3-hydroxy-4-(5-methyl-2-furoyl)-1,5-dihydro-2H-pyrrol-2-one::2-(3-ethoxyphenyl)-3-(5-methylfuran-2-yl)carbonyl-4-oxidanyl-1-(phenylmethyl)-2H-pyrrol-5-one::2-(3-ethoxyphenyl)-4-hydroxy-3-[(5-methyl-2-furanyl)-oxomethyl]-1-(phenylmethyl)-2H-pyrrol-5-one::MLS001146561::SMR000672598::cid_4611776
SMILES CCOc1cccc(c1)C1C(C(=O)c2ccc(C)o2)C(=O)C(=O)N1Cc1ccccc1
InChI Key InChIKey=QCPLWGGHUXKTRA-UHFFFAOYSA-N
Data  1 IC50
  Tab Delimited (TSV)   2D SDfile   Computed 3D by Vconf -m prep SDfile
Find this compound or compounds like it in BindingDB:
Activity Spreadsheet -- Enzyme Inhibition Constant Data from BindingDB
Found 1 hit for monomerid = 55069
TargetGenome polyprotein(Hepatitis C virus)
The Scripps Research Institute Molecular Screening Center
Curated by PubChem BioAssay
LigandPNGBDBM55069(1-benzyl-2-(3-ethoxyphenyl)-4-hydroxy-3-(5-methylf...)
Affinity DataIC50:  4.29E+3nM. Assay description: Source (MLPCN Center Name): The Scripps Research Institute Molecular Screening Center (SRIMSC) Center Affiliation: The Scripps Research Institute (TS...
In DepthDetails PCBioAssay