BDBM55070 2-(3-methoxy-4-phenylmethoxy-phenyl)-3-(5-methylfuran-2-yl)carbonyl-1-(5-methyl-1,2-oxazol-3-yl)-4-oxidanyl-2H-pyrrol-5-one::4-hydroxy-2-(3-methoxy-4-phenylmethoxyphenyl)-3-(5-methylfuran-2-carbonyl)-1-(5-methyl-1,2-oxazol-3-yl)-2H-pyrrol-5-one::4-hydroxy-2-(3-methoxy-4-phenylmethoxyphenyl)-3-[(5-methyl-2-furanyl)-oxomethyl]-1-(5-methyl-3-isoxazolyl)-2H-pyrrol-5-one::5-(4-benzoxy-3-methoxy-phenyl)-3-hydroxy-4-(5-methyl-2-furoyl)-1-(5-methylisoxazol-3-yl)-3-pyrrolin-2-one::MLS001147819::SMR000646998::cid_4371917
SMILES COc1cc(ccc1OCc1ccccc1)C1C(C(=O)c2ccc(C)o2)C(=O)C(=O)N1c1cc(C)on1
InChI Key InChIKey=YBNGPELHZMFCDX-UHFFFAOYSA-N
Data  1 IC50
  Tab Delimited (TSV)   2D SDfile   Computed 3D by Vconf -m prep SDfile
Find this compound or compounds like it in BindingDB:
Activity Spreadsheet -- Enzyme Inhibition Constant Data from BindingDB
Found 1 hit for monomerid = 55070
TargetGenome polyprotein(Hepatitis C virus)
The Scripps Research Institute Molecular Screening Center
Curated by PubChem BioAssay
LigandPNGBDBM55070(2-(3-methoxy-4-phenylmethoxy-phenyl)-3-(5-methylfu...)
Affinity DataIC50:  2.68E+3nM. Assay description: Source (MLPCN Center Name): The Scripps Research Institute Molecular Screening Center (SRIMSC) Center Affiliation: The Scripps Research Institute (TS...
In DepthDetails PCBioAssay