BDBM5531 2-(3 -Chloroanilino)-6-cyclohexylmethoxypurine::N-(3-chlorophenyl)-6-(cyclohexylmethoxy)-9H-purin-2-amine::O6-Cyclohexylmethylguanine deriv. 15
SMILES Clc1cccc(Nc2nc(OCC3CCCCC3)c3[nH]cnc3n2)c1
InChI Key InChIKey=OUEGMEMDEAOAEG-UHFFFAOYSA-N
Data  2 IC50
PDB links: 1 PDB ID matches this monomer.
  Tab Delimited (TSV)   2D SDfile   Computed 3D by Vconf -m prep SDfile
Find this compound or compounds like it in BindingDB:
Activity Spreadsheet -- Enzyme Inhibition Constant Data from BindingDB
Found 2 hits for monomerid = 5531
TargetCyclin-A2 [171-432]/Cyclin-dependent kinase 2(Homo sapiens (Human))
University Of Newcastle
LigandPNGBDBM5531(2-(3 -Chloroanilino)-6-cyclohexylmethoxypurine | N...)
Affinity DataIC50:  2.30E+3nM. Assay description: The enzyme was assayed with substrate histone H1 in the presence of 12.5 uM ATP/[gamma-32P] ATP. IC50 is the inhibitor concentration, which inhibits ...
TargetCyclin-dependent kinase 1/G2/mitotic-specific cyclin-B(Marthasterias glacialis (starfish))
University Of Newcastle
LigandPNGBDBM5531(2-(3 -Chloroanilino)-6-cyclohexylmethoxypurine | N...)
Affinity DataIC50:  2.20E+3nM. Assay description: The enzyme was assayed with substrate histone H1 in the presence of 12.5 uM ATP/[gamma-32P] ATP. IC50 is the inhibitor concentration, which inhibits ...
In DepthDetails ArticlePubMed