BDBM5555 4-(6-Cyclohexylmethoxypurin-2-ylamino)benzoic Acid::4-{[6-(cyclohexylmethoxy)-9H-purin-2-yl]amino}benzoic acid::O6-Cyclohexylmethylguanine deriv. 39
SMILES OC(=O)c1ccc(Nc2nc(OCC3CCCCC3)c3[nH]cnc3n2)cc1
InChI Key InChIKey=TVEHBRDXVINFRZ-UHFFFAOYSA-N
Data  2 IC50
  Tab Delimited (TSV)   2D SDfile   Computed 3D by Vconf -m prep SDfile
Find this compound or compounds like it in BindingDB:
Activity Spreadsheet -- Enzyme Inhibition Constant Data from BindingDB
Found 2 hits for monomerid = 5555
TargetCyclin-A2 [171-432]/Cyclin-dependent kinase 2(Homo sapiens (Human))
University Of Newcastle
LigandPNGBDBM5555(4-(6-Cyclohexylmethoxypurin-2-ylamino)benzoic Acid...)
Affinity DataIC50:  800nM. Assay description: The enzyme was assayed with substrate histone H1 in the presence of 12.5 uM ATP/[gamma-32P] ATP. IC50 is the inhibitor concentration, which inhibits ...
In DepthDetails ArticlePubMed
TargetCyclin-dependent kinase 1/G2/mitotic-specific cyclin-B(Marthasterias glacialis (starfish))
University Of Newcastle
LigandPNGBDBM5555(4-(6-Cyclohexylmethoxypurin-2-ylamino)benzoic Acid...)
Affinity DataIC50:  1.00E+3nM. Assay description: The enzyme was assayed with substrate histone H1 in the presence of 12.5 uM ATP/[gamma-32P] ATP. IC50 is the inhibitor concentration, which inhibits ...
In DepthDetails ArticlePubMed