BDBM57873 MLS000621994::N-[3-[4-(3-chlorophenyl)-1-piperazinyl]propyl]-2-[2-[(2-sulfanylidene-1H-quinazolin-4-yl)amino]-4-thiazolyl]acetamide::N-[3-[4-(3-chlorophenyl)piperazin-1-yl]propyl]-2-[2-[(2-sulfanylidene-1H-quinazolin-4-yl)amino]-1,3-thiazol-4-yl]acetamide::N-[3-[4-(3-chlorophenyl)piperazin-1-yl]propyl]-2-[2-[(2-sulfanylidene-1H-quinazolin-4-yl)amino]-1,3-thiazol-4-yl]ethanamide::N-[3-[4-(3-chlorophenyl)piperazino]propyl]-2-[2-[(2-thioxo-1H-quinazolin-4-yl)amino]thiazol-4-yl]acetamide::N-{3-[4-(3-chlorophenyl)piperazin-1-yl]propyl}-2-{2-[(2-thioxo-1,2-dihydroquinazolin-4-yl)amino]-1,3-thiazol-4-yl}acetamide::SMR000310921::cid_16193461
SMILES Clc1cccc(c1)N1CCN(CCCNC(=O)Cc2csc(Nc3[nH]c(=S)nc4ccccc34)n2)CC1
InChI Key InChIKey=PBEXWGCHZSTBSH-UHFFFAOYSA-N
Data  1 EC50
  Tab Delimited (TSV)   2D SDfile   Computed 3D by Vconf -m prep SDfile
Find this compound or compounds like it in BindingDB:
Activity Spreadsheet -- Enzyme Inhibition Constant Data from BindingDB
Found 1 hit for monomerid = 57873
TargetStreptokinase A(Streptococcus pyogenes M1 GAS)
Broad Institute
Curated by PubChem BioAssay
LigandPNGBDBM57873(MLS000621994 | N-[3-[4-(3-chlorophenyl)-1-piperazi...)
Affinity DataEC50:  1.50E+5nM. Assay description: Keywords: Group A streptococcus, GAS, streptokinase, expression, virulence, inhibition, dose response, EC50 Assay Overview: The goal of this assa...
In DepthDetails PCBioAssay