BDBM58057 1-Hydrazono-4,4,6,8,9-pentamethyl-1H,4H-pyrrolo[3,2,1-ij]quinolin-2-one::MLS000778260::SMR000414935::cid_6878577
SMILES CC1=CC(C)(C)N2C(=O)\C(=N/N)c3c2c1cc(C)c3C
InChI Key InChIKey=XTNKONNFINNJTE-AQTBWJFISA-N
Data  1 EC50
  Tab Delimited (TSV)   2D SDfile   Computed 3D by Vconf -m prep SDfile
Find this compound or compounds like it in BindingDB:
Activity Spreadsheet -- Enzyme Inhibition Constant Data from BindingDB
Found 1 hit for monomerid = 58057
TargetStreptokinase A(Streptococcus pyogenes M1 GAS)
Broad Institute
Curated by PubChem BioAssay
LigandPNGBDBM58057(1-Hydrazono-4,4,6,8,9-pentamethyl-1H,4H-pyrrolo[3,...)
Affinity DataEC50:  1.63E+4nM. Assay description: Keywords: Group A streptococcus, GAS, streptokinase, expression, virulence, inhibition, dose response, EC50 Assay Overview: The goal of this assa...
In DepthDetails PCBioAssay