BDBM58082 (5-tert-Butyl-3-phenyl-pyrazolo[1,5-a]pyrimidin-7-yl)-pyridin-2-ylmethyl-amine::(5-tert-butyl-3-phenyl-pyrazolo[1,5-a]pyrimidin-7-yl)-(2-pyridylmethyl)amine::5-tert-butyl-3-phenyl-N-(2-pyridinylmethyl)-7-pyrazolo[1,5-a]pyrimidinamine::5-tert-butyl-3-phenyl-N-(pyridin-2-ylmethyl)pyrazolo[1,5-a]pyrimidin-7-amine::MLS000762868::SMR000439705::cid_1862178
SMILES CC(C)(C)c1cc(NCc2ccccn2)n2ncc(-c3ccccc3)c2n1
InChI Key InChIKey=JMJYOTIXZUULGK-UHFFFAOYSA-N
Data  1 EC50
  Tab Delimited (TSV)   2D SDfile   Computed 3D by Vconf -m prep SDfile
Find this compound or compounds like it in BindingDB:
Activity Spreadsheet -- Enzyme Inhibition Constant Data from BindingDB
Found 1 hit for monomerid = 58082
TargetStreptokinase A(Streptococcus pyogenes M1 GAS)
Broad Institute
Curated by PubChem BioAssay
LigandPNGBDBM58082((5-tert-Butyl-3-phenyl-pyrazolo[1,5-a]pyrimidin-7-...)
Affinity DataEC50:  3.00E+4nM. Assay description: Keywords: Group A streptococcus, GAS, streptokinase, expression, virulence, inhibition, dose response, EC50 Assay Overview: The goal of this assa...
In DepthDetails PCBioAssay