BDBM58089 5-tert-butyl-3-(4-chlorophenyl)-N-(2-pyridinylmethyl)-7-pyrazolo[1,5-a]pyrimidinamine::5-tert-butyl-3-(4-chlorophenyl)-N-(pyridin-2-ylmethyl)pyrazolo[1,5-a]pyrimidin-7-amine::MLS000762893::SMR000439717::[5-tert-Butyl-3-(4-chloro-phenyl)-pyrazolo[1,5-a]pyrimidin-7-yl]-pyridin-2-ylmethyl-amine::[5-tert-butyl-3-(4-chlorophenyl)pyrazolo[1,5-a]pyrimidin-7-yl]-(2-pyridylmethyl)amine::cid_1838594
SMILES CC(C)(C)c1cc(NCc2ccccn2)n2ncc(-c3ccc(Cl)cc3)c2n1
InChI Key InChIKey=SWXVTPFMCSJUME-UHFFFAOYSA-N
Data  1 EC50
  Tab Delimited (TSV)   2D SDfile   Computed 3D by Vconf -m prep SDfile
Find this compound or compounds like it in BindingDB:
Activity Spreadsheet -- Enzyme Inhibition Constant Data from BindingDB
Found 1 hit for monomerid = 58089
TargetStreptokinase A(Streptococcus pyogenes M1 GAS)
Broad Institute
Curated by PubChem BioAssay
LigandPNGBDBM58089(5-tert-butyl-3-(4-chlorophenyl)-N-(2-pyridinylmeth...)
Affinity DataEC50:  1.50E+5nM. Assay description: Keywords: Group A streptococcus, GAS, streptokinase, expression, virulence, inhibition, dose response, EC50 Assay Overview: The goal of this assa...
In DepthDetails PCBioAssay