BDBM5857 2-Anilino-5-aryloxazole 18::N-(3,5-Dimethoxyphenyl)-5-phenyl-1,3-oxazol-2-amine Hydrochloride::N-(3,5-dimethoxyphenyl)-5-phenyl-1,3-oxazol-2-amine
SMILES COc1cc(Nc2ncc(o2)-c2ccccc2)cc(OC)c1
InChI Key InChIKey=RKNRDRPDYXCRPG-UHFFFAOYSA-N
Data  1 IC50
  Tab Delimited (TSV)   2D SDfile   Computed 3D by Vconf -m prep SDfile
Find this compound or compounds like it in BindingDB:
Activity Spreadsheet -- Enzyme Inhibition Constant Data from BindingDB
Found 1 hit for monomerid = 5857
TargetVascular endothelial growth factor receptor 2(Homo sapiens (Human))
Glaxosmithkline
LigandPNGBDBM5857(2-Anilino-5-aryloxazole 18 | N-(3,5-Dimethoxypheny...)
Affinity DataIC50:  170nMpH: 7.5 T: 2°C. Assay description: The assay was using baculovirus-expressed recombinant protein kinase purified as the intracellular domain fused by GST tag, interacting with biotinyl...
In DepthDetails ArticlePubMed