BDBM58953 4-[[4-(dimethylamino)anilino]-oxomethyl]-1-ethyl-3,5-dimethyl-2-pyrrolecarboxylic acid ethyl ester::4-[[4-(dimethylamino)phenyl]carbamoyl]-1-ethyl-3,5-dimethyl-pyrrole-2-carboxylic acid ethyl ester::MLS000093267::SMR000028889::cid_3237746::ethyl 4-({[4-(dimethylamino)phenyl]amino}carbonyl)-1-ethyl-3,5-dimethyl-1H-pyrrole-2-carboxylate::ethyl 4-[[4-(dimethylamino)phenyl]carbamoyl]-1-ethyl-3,5-dimethyl-pyrrole-2-carboxylate::ethyl 4-[[4-(dimethylamino)phenyl]carbamoyl]-1-ethyl-3,5-dimethylpyrrole-2-carboxylate
SMILES CCOC(=O)c1c(C)c(C(=O)Nc2ccc(cc2)N(C)C)c(C)n1CC
InChI Key InChIKey=GJMWDMYMRHPCED-UHFFFAOYSA-N
Data  1 IC50  1 EC50
  Tab Delimited (TSV)   2D SDfile   Computed 3D by Vconf -m prep SDfile
Find this compound or compounds like it in BindingDB:
Activity Spreadsheet -- Enzyme Inhibition Constant Data from BindingDB
Found 2 hits for monomerid = 58953
TargetLarge T antigen(Simian virus 40)
Southern Research Specialized Biocontainment Screening Center
Curated by PubChem BioAssay
LigandPNGBDBM58953(4-[[4-(dimethylamino)anilino]-oxomethyl]-1-ethyl-3...)
Affinity DataEC50: >5.00E+4nM. Assay description: Southern Research's Specialized Biocontainment Screening Center (SRSBSC) Southern Research Institute (Birmingham, Alabama) NIH Molecular Librarie...
In DepthDetails PCBioAssay
TargetLarge T antigen(Simian virus 40)
Southern Research Specialized Biocontainment Screening Center
Curated by PubChem BioAssay
LigandPNGBDBM58953(4-[[4-(dimethylamino)anilino]-oxomethyl]-1-ethyl-3...)
Affinity DataIC50:  1.51E+4nM. Assay description: A biochemical assay using the ADP-Hunter methodology, purified TAg, and ATP to identify compounds that inhibit the ATPase activity of Tag Southern Re...
In DepthDetails PCBioAssay