BDBM59274 2-{4-[3-(4-Isopropyl-phenyl)-ureido]-piperidin-1-yl}-N-naphthalen-1-yl-acetamide::MLS000122731::N-(1-naphthalenyl)-2-[4-[[oxo-(4-propan-2-ylanilino)methyl]amino]-1-piperidinyl]acetamide::N-(1-naphthyl)-2-[4-(p-cumenylcarbamoylamino)piperidino]acetamide::N-naphthalen-1-yl-2-[4-[(4-propan-2-ylphenyl)carbamoylamino]piperidin-1-yl]acetamide::N-naphthalen-1-yl-2-[4-[(4-propan-2-ylphenyl)carbamoylamino]piperidin-1-yl]ethanamide::SMR000120117::cid_3220891
SMILES CC(C)c1ccc(NC(=O)NC2CCN(CC(=O)Nc3cccc4ccccc34)CC2)cc1
InChI Key InChIKey=RXWUPUDUCHEETG-UHFFFAOYSA-N
Data  2 IC50  3 EC50
  Tab Delimited (TSV)   2D SDfile   Computed 3D by Vconf -m prep SDfile
Find this compound or compounds like it in BindingDB:
Activity Spreadsheet -- Enzyme Inhibition Constant Data from BindingDB
Found 5 hits for monomerid = 59274
TargetAlkaline phosphatase, tissue-nonspecific isozyme(Homo sapiens (Human))
Sanford-Burnham Center For Chemical Genomics
Curated by PubChem BioAssay
LigandPNGBDBM59274(2-{4-[3-(4-Isopropyl-phenyl)-ureido]-piperidin-1-y...)
Affinity DataEC50:  1.00E+5nM. Assay description: Data Source: Sanford-Burnham Center for Chemical Genomics (SBCCG) Source Affiliation: Sanford-Burnham Medical Research Institute (SBMRI, San Diego, C...
In DepthDetails PCBioAssay
TargetIntestinal-type alkaline phosphatase(Homo sapiens (Human))
Burnham Center For Chemical Genomics
Curated by PubChem BioAssay
LigandPNGBDBM59274(2-{4-[3-(4-Isopropyl-phenyl)-ureido]-piperidin-1-y...)
Affinity DataEC50: >1.00E+5nM. Assay description: Data Source: Sanford-Burnham Center for Chemical Genomics (SBCCG) Source Affiliation: Sanford-Burnham Medical Research Institute (SBMRI, San Diego, C...
In DepthDetails PCBioAssay
TargetIntestinal-type alkaline phosphatase 1(Rattus norvegicus (Rat))
Burnham Center For Chemical Genomics
Curated by PubChem BioAssay
LigandPNGBDBM59274(2-{4-[3-(4-Isopropyl-phenyl)-ureido]-piperidin-1-y...)
Affinity DataIC50:  1.08E+4nM. Assay description: Data Source: Sanford-Burnham Center for Chemical Genomics (SBCCG) Source Affiliation: Sanford-Burnham Medical Research Institute (SBMRI, San Diego, C...
In DepthDetails PCBioAssay
TargetAlkaline phosphatase, tissue-nonspecific isozyme(Homo sapiens (Human))
Sanford-Burnham Center For Chemical Genomics
Curated by PubChem BioAssay
LigandPNGBDBM59274(2-{4-[3-(4-Isopropyl-phenyl)-ureido]-piperidin-1-y...)
Affinity DataIC50:  5.93E+4nM. Assay description: Data Source: Sanford-Burnham Center for Chemical Genomics (SBCCG) Source Affiliation: Sanford-Burnham Medical Research Institute (SBMRI, San Diego, C...
In DepthDetails PCBioAssay
TargetAlkaline phosphatase, germ cell type(Homo sapiens (Human))
Burnham Center For Chemical Genomics
Curated by PubChem BioAssay
LigandPNGBDBM59274(2-{4-[3-(4-Isopropyl-phenyl)-ureido]-piperidin-1-y...)
Affinity DataEC50:  5.59E+4nM. Assay description: Data Source: Sanford-Burnham Center for Chemical Genomics (SBCCG) Source Affiliation: Sanford-Burnham Medical Research Institute (SBMRI, San Diego, C...
In DepthDetails PCBioAssay