BDBM59275 1-[(4-chloranyl-1,5-dimethyl-pyrazol-3-yl)carbonylamino]-3-phenyl-thiourea::1-[(4-chloro-1,5-dimethyl-pyrazole-3-carbonyl)amino]-3-phenyl-thiourea::1-[(4-chloro-1,5-dimethylpyrazole-3-carbonyl)amino]-3-phenylthiourea::1-[[(4-chloro-1,5-dimethyl-3-pyrazolyl)-oxomethyl]amino]-3-phenylthiourea::2-[(4-chloro-1,5-dimethyl-1H-pyrazol-3-yl)carbonyl]-N-phenylhydrazinecarbothioamide::MLS000324946::SMR000159994::cid_842888
SMILES Cc1c(Cl)c(nn1C)C(=O)NNC(=S)Nc1ccccc1
InChI Key InChIKey=PJVBDTHYBRVLSE-UHFFFAOYSA-N
Data  1 IC50  1 EC50
  Tab Delimited (TSV)   2D SDfile   Computed 3D by Vconf -m prep SDfile
Find this compound or compounds like it in BindingDB:
Activity Spreadsheet -- Enzyme Inhibition Constant Data from BindingDB
Found 2 hits for monomerid = 59275
TargetGroup 3 secretory phospholipase A2(Homo sapiens)
The Scripps Research Institute Molecular Screening Center
Curated by PubChem BioAssay
LigandPNGBDBM59275(1-[(4-chloranyl-1,5-dimethyl-pyrazol-3-yl)carbonyl...)
Affinity DataIC50:  1.22E+5nM. Assay description: Source (MLPCN Center Name): The Scripps Research Institute Molecular Screening Center Affiliation: The Scripps Research Institute, TSRI Assay Provide...
In DepthDetails PCBioAssay
TargetAlkaline phosphatase, tissue-nonspecific isozyme(Homo sapiens (Human))
Sanford-Burnham Center For Chemical Genomics
Curated by PubChem BioAssay
LigandPNGBDBM59275(1-[(4-chloranyl-1,5-dimethyl-pyrazol-3-yl)carbonyl...)
Affinity DataEC50:  5.05E+4nM. Assay description: Data Source: Sanford-Burnham Center for Chemical Genomics (SBCCG) Source Affiliation: Sanford-Burnham Medical Research Institute (SBMRI, San Diego, C...
In DepthDetails PCBioAssay