BDBM59279 1-ethyl-3-[(2-isobutylquinoline-4-carbonyl)amino]thiourea::1-ethyl-3-[[2-(2-methylpropyl)quinolin-4-yl]carbonylamino]thiourea::1-ethyl-3-[[2-(2-methylpropyl)quinoline-4-carbonyl]amino]thiourea::1-ethyl-3-[[[2-(2-methylpropyl)-4-quinolinyl]-oxomethyl]amino]thiourea::MLS000545503::N-ethyl-2-[(2-isobutyl-4-quinolinyl)carbonyl]hydrazinecarbothioamide::SMR000160222::cid_1767737
SMILES CCNC(=S)NNC(=O)c1cc(CC(C)C)nc2ccccc12
InChI Key InChIKey=MYTRQYCYPXKAQI-UHFFFAOYSA-N
Data  1 EC50
  Tab Delimited (TSV)   2D SDfile   Computed 3D by Vconf -m prep SDfile
Find this compound or compounds like it in BindingDB:
Activity Spreadsheet -- Enzyme Inhibition Constant Data from BindingDB
Found 1 hit for monomerid = 59279
TargetAlkaline phosphatase, tissue-nonspecific isozyme(Homo sapiens (Human))
Sanford-Burnham Center For Chemical Genomics
Curated by PubChem BioAssay
LigandPNGBDBM59279(1-ethyl-3-[(2-isobutylquinoline-4-carbonyl)amino]t...)
Affinity DataEC50:  6.30E+4nM. Assay description: Data Source: Sanford-Burnham Center for Chemical Genomics (SBCCG) Source Affiliation: Sanford-Burnham Medical Research Institute (SBMRI, San Diego, C...
In DepthDetails PCBioAssay