BDBM60274 MLS001056594::Naltriben methanesulfonate hydrate::SMR000326972::cid_16219722
SMILES O.CS(O)(=O)=O.[H][C@@]12Oc3c4c(C[C@]5([H])N(CC6CC6)CC[C@@]14[C@@]5(O)Cc1c2oc2ccccc12)ccc3O
InChI Key InChIKey=VAGWKZSGWSRENH-JRKKIACPSA-N
Data  1 IC50
  Tab Delimited (TSV)   2D SDfile   Computed 3D by Vconf -m prep SDfile
Find this compound or compounds like it in BindingDB:
Activity Spreadsheet -- Enzyme Inhibition Constant Data from BindingDB
Found 1 hit for monomerid = 60274
TargetKappa-type opioid receptor(Homo sapiens (Human))
Burnham Center For Chemical Genomics
Curated by PubChem BioAssay
LigandPNGBDBM60274(MLS001056594 | Naltriben methanesulfonate hydrate ...)
Affinity DataIC50:  699nM. Assay description: Data Source: Sanford-Burnham Center for Chemical Genomics (SBCCG) Source Affiliation: Sanford-Burnham Medical Research Institute (SBMRI, San Diego, C...
In DepthDetails PCBioAssay