BDBM61420 4,5-diphenyl-2-(1-pyrrolidinylmethylideneamino)-3-furancarbonitrile::4,5-diphenyl-2-(pyrrolidin-1-ylmethylideneamino)furan-3-carbonitrile::4,5-diphenyl-2-(pyrrolidinomethyleneamino)-3-furonitrile::MLS000108550::SMR000104504::cid_1356159
SMILES N#Cc1c(N=CN2CCCC2)oc(c1-c1ccccc1)-c1ccccc1
InChI Key InChIKey=PBZZQWVRVASUDK-UHFFFAOYSA-N
Data  1 IC50
  Tab Delimited (TSV)   2D SDfile   Computed 3D by Vconf -m prep SDfile
Find this compound or compounds like it in BindingDB:
Activity Spreadsheet -- Enzyme Inhibition Constant Data from BindingDB
Found 1 hit for monomerid = 61420
TargetG-protein coupled receptor 55(Homo sapiens (Human))
Burnham Center For Chemical Genomics
Curated by PubChem BioAssay
LigandPNGBDBM61420(4,5-diphenyl-2-(1-pyrrolidinylmethylideneamino)-3-...)
Affinity DataIC50:  558nM. Assay description: Data Source: Sanford-Burnham Center for Chemical Genomics (SBCCG) Source Affiliation: Sanford-Burnham Medical Research Institute (SBMRI, San Diego, C...
In DepthDetails PCBioAssay