BDBM62389 MLS-0425688.0001::N-[4-(4-methoxyphenyl)-1,3-thiazol-2-yl]-2-[(4-methyl-[1,2,4]triazolo[4,3-a]quinolin-1-yl)sulfanyl]acetamide::N-[4-(4-methoxyphenyl)-1,3-thiazol-2-yl]-2-[(4-methyl-[1,2,4]triazolo[4,3-a]quinolin-1-yl)sulfanyl]ethanamide::N-[4-(4-methoxyphenyl)-2-thiazolyl]-2-[(4-methyl-[1,2,4]triazolo[4,3-a]quinolin-1-yl)thio]acetamide::N-[4-(4-methoxyphenyl)thiazol-2-yl]-2-[(4-methyl-[1,2,4]triazolo[4,3-a]quinolin-1-yl)thio]acetamide::cid_1374043
SMILES COc1ccc(cc1)-c1csc(NC(=O)CSc2nnc3c(C)cc4ccccc4n23)n1
InChI Key InChIKey=VTIQOPXBRQFVHQ-UHFFFAOYSA-N
Data  2 IC50  1 EC50
  Tab Delimited (TSV)   2D SDfile   Computed 3D by Vconf -m prep SDfile
Find this compound or compounds like it in BindingDB:
Activity Spreadsheet -- Enzyme Inhibition Constant Data from BindingDB
Found 3 hits for monomerid = 62389
TargetG-protein coupled receptor 35(Homo sapiens (Human))
Burnham Center For Chemical Genomics
Curated by PubChem BioAssay
LigandPNGBDBM62389(MLS-0425688.0001 | N-[4-(4-methoxyphenyl)-1,3-thia...)
Affinity DataIC50:  3.20E+4nM. Assay description: Data Source: Sanford-Burnham Center for Chemical Genomics Source Affiliation: Sanford-Burnham Medical Research Institute Network: NIH Molecular Lib...
In DepthDetails PCBioAssay
TargetCannabinoid receptor 2(Homo sapiens (Human))
Burnham Center For Chemical Genomics
Curated by PubChem BioAssay
LigandPNGBDBM62389(MLS-0425688.0001 | N-[4-(4-methoxyphenyl)-1,3-thia...)
Affinity DataEC50: >3.20E+4nM. Assay description: Data Source: Sanford-Burnham Center for Chemical Genomics Source Affiliation: Sanford-Burnham Medical Research Institute (SBMRI, San Diego, CA) Net...
In DepthDetails PCBioAssay
TargetCannabinoid receptor 2(Homo sapiens (Human))
Burnham Center For Chemical Genomics
Curated by PubChem BioAssay
LigandPNGBDBM62389(MLS-0425688.0001 | N-[4-(4-methoxyphenyl)-1,3-thia...)
Affinity DataIC50: >3.20E+4nM. Assay description: Data Source: Sanford-Burnham Center for Chemical Genomics Source Affiliation: Sanford-Burnham Medical Research Institute (SBMRI, San Diego, CA) Netw...
In DepthDetails PCBioAssay