BDBM63368 7-(2-morpholin-4-ylethylamino)isoquinoline-5,8-dione::7-(2-morpholinoethylamino)isoquinoline-5,8-quinone::7-[2-(4-morpholinyl)ethylamino]isoquinoline-5,8-dione::MLS000563617::SMR000389057::cid_5461521
SMILES Oc1cc(N=CCN2CCOCC2)c(O)c2cnccc12
InChI Key InChIKey=GHNMLZSUMRXXPV-UHFFFAOYSA-N
Data  1 EC50
  Tab Delimited (TSV)   2D SDfile   Computed 3D by Vconf -m prep SDfile
Find this compound or compounds like it in BindingDB:
Activity Spreadsheet -- Enzyme Inhibition Constant Data from BindingDB
Found 1 hit for monomerid = 63368
TargetHeat shock factor protein 1(Mus musculus)
Broad Institute
Curated by PubChem BioAssay
LigandPNGBDBM63368(7-(2-morpholin-4-ylethylamino)isoquinoline-5,8-dio...)
Affinity DataEC50:  1.04E+4nM. Assay description: Keywords: Heat Shock Factor-1 (HSF-1), Stress Response, MG132, NIH3T3, Luminescence Assay Overview: Modified NIH3T3, transformed to express firefly...
In DepthDetails PCBioAssay