BDBM63372 2-[3-(4-Chloro-phenyl)-5-oxo-[1,2,4]oxadiazol-4-yl]-N-(2-ethoxy-phenyl)-acetamide::2-[3-(4-chlorophenyl)-5-keto-1,2,4-oxadiazol-4-yl]-N-o-phenetyl-acetamide::2-[3-(4-chlorophenyl)-5-oxidanylidene-1,2,4-oxadiazol-4-yl]-N-(2-ethoxyphenyl)ethanamide::2-[3-(4-chlorophenyl)-5-oxo-1,2,4-oxadiazol-4-yl]-N-(2-ethoxyphenyl)acetamide::MLS000529487::SMR000121962::cid_1435069
SMILES CCOc1ccccc1NC(=O)Cn1c(noc1=O)-c1ccc(Cl)cc1
InChI Key InChIKey=USKROHUBRILDGO-UHFFFAOYSA-N
Data  1 EC50
  Tab Delimited (TSV)   2D SDfile   Computed 3D by Vconf -m prep SDfile
Find this compound or compounds like it in BindingDB:
Activity Spreadsheet -- Enzyme Inhibition Constant Data from BindingDB
Found 1 hit for monomerid = 63372
TargetHeat shock factor protein 1(Mus musculus)
Broad Institute
Curated by PubChem BioAssay
LigandPNGBDBM63372(2-[3-(4-Chloro-phenyl)-5-oxo-[1,2,4]oxadiazol-4-yl...)
Affinity DataEC50: >1.95E+5nM. Assay description: Keywords: Heat Shock Factor-1 (HSF-1), Stress Response, MG132, NIH3T3, Luminescence Assay Overview: Modified NIH3T3, transformed to express firefly...
In DepthDetails PCBioAssay