BDBM63385 (E)-N-(4-chloranyl-2-methoxy-5-methyl-phenyl)-2-cyano-3-(4-methoxy-3-oxidanyl-phenyl)prop-2-enamide::(E)-N-(4-chloro-2-methoxy-5-methyl-phenyl)-2-cyano-3-(3-hydroxy-4-methoxy-phenyl)acrylamide::(E)-N-(4-chloro-2-methoxy-5-methylphenyl)-2-cyano-3-(3-hydroxy-4-methoxyphenyl)-2-propenamide::(E)-N-(4-chloro-2-methoxy-5-methylphenyl)-2-cyano-3-(3-hydroxy-4-methoxyphenyl)prop-2-enamide::MLS000374668::SMR000242085::cid_2420204
SMILES COc1ccc(\C=C(/C#N)C(=O)Nc2cc(C)c(Cl)cc2OC)cc1O
InChI Key InChIKey=ZBLKWSYHWFEEOK-NTUHNPAUSA-N
Data  1 EC50
  Tab Delimited (TSV)   2D SDfile   Computed 3D by Vconf -m prep SDfile
Find this compound or compounds like it in BindingDB:
Activity Spreadsheet -- Enzyme Inhibition Constant Data from BindingDB
Found 1 hit for monomerid = 63385
TargetHeat shock factor protein 1(Mus musculus)
Broad Institute
Curated by PubChem BioAssay
LigandPNGBDBM63385((E)-N-(4-chloranyl-2-methoxy-5-methyl-phenyl)-2-cy...)
Affinity DataEC50: >1.95E+5nM. Assay description: Keywords: Heat Shock Factor-1 (HSF-1), Stress Response, MG132, NIH3T3, Luminescence Assay Overview: Modified NIH3T3, transformed to express firefly...
In DepthDetails PCBioAssay