BDBM63391 2-(4-ethoxyanilino)-1-(4-methylphenyl)ethanone::2-(p-phenetidino)-1-(p-tolyl)ethanone::2-[(4-ethoxyphenyl)amino]-1-(4-methylphenyl)ethanone::MLS000717972::SMR000279540::cid_788501
SMILES CCOc1ccc(NCC(=O)c2ccc(C)cc2)cc1
InChI Key InChIKey=DKRCRVBNRGEYMS-UHFFFAOYSA-N
Data  1 EC50
  Tab Delimited (TSV)   2D SDfile   Computed 3D by Vconf -m prep SDfile
Find this compound or compounds like it in BindingDB:
Activity Spreadsheet -- Enzyme Inhibition Constant Data from BindingDB
Found 1 hit for monomerid = 63391
TargetHeat shock factor protein 1(Mus musculus)
Broad Institute
Curated by PubChem BioAssay
LigandPNGBDBM63391(2-(4-ethoxyanilino)-1-(4-methylphenyl)ethanone | 2...)
Affinity DataEC50: >1.95E+5nM. Assay description: Keywords: Heat Shock Factor-1 (HSF-1), Stress Response, MG132, NIH3T3, Luminescence Assay Overview: Modified NIH3T3, transformed to express firefly...
Ligand InfoPC cidPC sid
In DepthDetails PCBioAssay