BDBM63654 MLS000517378::N-(3,5-dimethoxyphenyl)-2-methyl-4-quinolinecarboxamide::N-(3,5-dimethoxyphenyl)-2-methyl-cinchoninamide::N-(3,5-dimethoxyphenyl)-2-methyl-quinoline-4-carboxamide::N-(3,5-dimethoxyphenyl)-2-methylquinoline-4-carboxamide::SMR000343473::cid_2122050
SMILES COc1cc(NC(=O)c2cc(C)nc3ccccc23)cc(OC)c1
InChI Key InChIKey=YGJSMFPZNRTHKI-UHFFFAOYSA-N
Data  1 EC50
  Tab Delimited (TSV)   2D SDfile   Computed 3D by Vconf -m prep SDfile
Find this compound or compounds like it in BindingDB:
Activity Spreadsheet -- Enzyme Inhibition Constant Data from BindingDB
Found 1 hit for monomerid = 63654
TargetHeat shock factor protein 1(Mus musculus)
Broad Institute
Curated by PubChem BioAssay
LigandPNGBDBM63654(MLS000517378 | N-(3,5-dimethoxyphenyl)-2-methyl-4-...)
Affinity DataEC50: >1.95E+5nM. Assay description: Keywords: Heat Shock Factor-1 (HSF-1), Stress Response, MG132, NIH3T3, Luminescence Assay Overview: Modified NIH3T3, transformed to express firefly...
In DepthDetails PCBioAssay