BDBM64099 2-(4-Hydroxy-6-methyl-pyrimidin-2-ylsulfanyl)-1-(4-methoxy-3-methyl-phenyl)-ethanone::2-[2-(4-methoxy-3-methyl-phenyl)-2-oxidanylidene-ethyl]sulfanyl-6-methyl-1H-pyrimidin-4-one::2-[2-(4-methoxy-3-methylphenyl)-2-oxoethyl]sulfanyl-6-methyl-1H-pyrimidin-4-one::2-[[2-(4-methoxy-3-methylphenyl)-2-oxoethyl]thio]-6-methyl-1H-pyrimidin-4-one::2-[[2-keto-2-(4-methoxy-3-methyl-phenyl)ethyl]thio]-6-methyl-1H-pyrimidin-4-one::MLS001206911::SMR000518038::cid_2062297
SMILES COc1ccc(cc1C)C(=O)CSc1nc(C)cc(=O)[nH]1
InChI Key InChIKey=MEDHYBPSDJOBIJ-UHFFFAOYSA-N
Data  1 EC50
  Tab Delimited (TSV)   2D SDfile   Computed 3D by Vconf -m prep SDfile
Find this compound or compounds like it in BindingDB:
Activity Spreadsheet -- Enzyme Inhibition Constant Data from BindingDB
Found 1 hit for monomerid = 64099
TargetHeat shock factor protein 1(Mus musculus)
Broad Institute
Curated by PubChem BioAssay
LigandPNGBDBM64099(2-(4-Hydroxy-6-methyl-pyrimidin-2-ylsulfanyl)-1-(4...)
Affinity DataEC50: >1.95E+5nM. Assay description: Keywords: Heat Shock Factor-1 (HSF-1), Stress Response, MG132, NIH3T3, Luminescence Assay Overview: Modified NIH3T3, transformed to express firefly...
In DepthDetails PCBioAssay