BDBM6433 3-[(4-{6-[(3-chlorophenyl)amino]pyrazin-2-yl}pyridin-2-yl)amino]propan-1-ol::3-{[4-[6-((3-Chlorophenyl)amino)pyrazin-2-yl]pyridin-2-yl]amino}propan-1-ol::Pyrazine-Pyridine deriv. 47
SMILES OCCCNc1cc(ccn1)-c1cncc(Nc2cccc(Cl)c2)n1
InChI Key InChIKey=FANRZXFLTSHAKQ-UHFFFAOYSA-N
Data  2 IC50
  Tab Delimited (TSV)   2D SDfile   Computed 3D by Vconf -m prep SDfile
Find this compound or compounds like it in BindingDB:
Activity Spreadsheet -- Enzyme Inhibition Constant Data from BindingDB
Found 2 hits for monomerid = 6433
TargetVascular endothelial growth factor receptor 2(Rattus norvegicus (rat))
Johnson & Johnson Pharmaceutical
LigandPNGBDBM6433(3-[(4-{6-[(3-chlorophenyl)amino]pyrazin-2-yl}pyrid...)
Affinity DataIC50:  500nM. Assay description: The enzyme was assayed with a biotinylated peptide substrate and test compounds in the presence of 5 uM ATP/[gamma-33P]ATP in a streptavidin coated F...
In DepthDetails ArticlePubMed
TargetCyclin-dependent kinase/G2/mitotic-specific cyclin- 1(Homo sapiens (Human))
Johnson & Johnson Pharmaceutical
LigandPNGBDBM6433(3-[(4-{6-[(3-chlorophenyl)amino]pyrazin-2-yl}pyrid...)
Affinity DataIC50:  500nMpH: 8.0 T: 2°C. Assay description: The enzyme was assayed with a biotinylated peptide substrate and test compounds in the presence of 5 uM ATP/[gamma-33P]ATP in a streptavidin coated F...
In DepthDetails ArticlePubMed