BDBM66025 1-(2-furanylmethyl)-2-[(4-methyl-1-piperazinyl)methylideneamino]-4,5-diphenyl-3-pyrrolecarbonitrile::1-(2-furfuryl)-2-[(4-methylpiperazino)methyleneamino]-4,5-diphenyl-pyrrole-3-carbonitrile::1-(furan-2-ylmethyl)-2-[(4-methylpiperazin-1-yl)methylideneamino]-4,5-diphenyl-pyrrole-3-carbonitrile::1-(furan-2-ylmethyl)-2-[(4-methylpiperazin-1-yl)methylideneamino]-4,5-diphenylpyrrole-3-carbonitrile::1-Furan-2-ylmethyl-2-{[1-(4-methyl-piperazin-1-yl)-meth-(E)-ylidene]-amino}-4,5-diphenyl-1H-pyrrole-3-c arbonitrile::MLS000556474::SMR000147791::cid_1531603
SMILES CN1CCN(CC1)C=Nc1c(C#N)c(c(-c2ccccc2)n1Cc1ccco1)-c1ccccc1
InChI Key InChIKey=GSLMHCIDVZVFAJ-UHFFFAOYSA-N
Data  1 EC50
  Tab Delimited (TSV)   2D SDfile   Computed 3D by Vconf -m prep SDfile
Find this compound or compounds like it in BindingDB:
Activity Spreadsheet -- Enzyme Inhibition Constant Data from BindingDB
Found 1 hit for monomerid = 66025
TargetGeneral amino acid permease AGP1(Saccharomyces cerevisiae S288c)
Nmmlsc
Curated by PubChem BioAssay
LigandPNGBDBM66025(1-(2-furanylmethyl)-2-[(4-methyl-1-piperazinyl)met...)
Affinity DataEC50:  4.61E+3nM. Assay description: University of New Mexico Assay Overview: Assay Support: 1R03 MH086450-01 Project Title: Chemical Screen of TOR pathway GFP fusion proteins in S. ...
In DepthDetails PCBioAssay