BDBM66452 MLS000697192::N-[4-(1-mesyl-5-phenyl-2-pyrazolin-3-yl)phenyl]methanesulfonamide::N-[4-(2-methylsulfonyl-3-phenyl-3,4-dihydropyrazol-5-yl)phenyl]methanesulfonamide::SMR000237696::cid_4571186
SMILES CS(=O)(=O)Nc1ccc(cc1)C1=NN(C(C1)c1ccccc1)S(C)(=O)=O
InChI Key InChIKey=GFFSJYBFMGNFNC-UHFFFAOYSA-N
Data  1 EC50
  Tab Delimited (TSV)   2D SDfile   Computed 3D by Vconf -m prep SDfile
Find this compound or compounds like it in BindingDB:
Activity Spreadsheet -- Enzyme Inhibition Constant Data from BindingDB
Found 1 hit for monomerid = 66452
TargetBcl-2-like protein 11(Homo sapiens (Human))
Broad Institute
Curated by PubChem BioAssay
LigandPNGBDBM66452(MLS000697192 | N-[4-(1-mesyl-5-phenyl-2-pyrazolin-...)
Affinity DataEC50: >3.50E+5nM. Assay description: Keywords: apoptosis, BH3 domain, Bcl2-A1, BIM, caspase, cancer Primary Collaborator: Todd Golub, Broad Institute, golub@broadinstitute.org Assay Over...
In DepthDetails PCBioAssay